{"text_format":"1","workbook":"xlsx","n_sheets":15,"sheets":["MATRICULA","APROV 1","PARTICIPACIÓN 1","Gráfica APROV 1","Gráfica PART 1","APROV 2","PARTICIPACIÓN 2","Gráfica APROV 2","Gráfica PART 2","APROV 3","PARTICIPACIÓN 3","Gráfica APROV 3","Gráfica PART 3","Gráfica Promedios Finales","NORMALIDAD MÍNIMA"],"not_rendered":{"charts":7,"images":1,"macros":1,"external_links":0,"defined_names":0,"comments":0,"pivot_tables":0},"unopened":[],"bounds":{"document_bytes":16777216,"sheet_cells":100000,"rows_first":2000,"rows_last":500,"rows_between":2000,"halvings":0,"cell_chars":16384,"cell_head_chars":4096},"cells_cut":0,"cells_raw":0,"read":"whole","date_system":"1900"}

{"sheet":"MATRICULA","index":0,"n_rows":35,"n_cols":37,"rows_kept":35,"cut":false,"hidden":false,"merged":[[29,34,29,36],[29,7,29,9],[29,1,29,3],[29,4,29,6],[12,1,12,12],[12,13,12,24],[13,1,13,3],[13,4,13,6],[13,7,13,9],[13,10,13,12],[13,13,13,15],[29,22,29,24],[29,10,29,12],[29,13,29,15],[29,16,29,18],[29,19,29,21],[11,0,14,0],[11,1,11,24],[27,25,28,36],[28,1,28,12],[28,13,28,24],[13,16,13,18],[13,19,13,21],[13,22,13,24],[29,25,29,27],[29,28,29,30],[29,31,29,33],[27,0,30,0],[27,1,27,24],[2,1,2,28],[3,1,3,28],[4,1,4,28],[7,0,7,2],[7,3,7,29],[8,0,8,2],[5,1,5,12],[5,13,5,23],[6,1,6,12],[6,13,6,23],[8,3,8,29]]}
[]
[]
[null,"Secretaría de Educación Pública del Estado de Baja California Sur"]
[null,"Dirección de Educación Secundaria"]
[null,"MATRÍCULA"]
[null,"PERIODO EVALUACIÓN:",null,null,null,null,null,null,null,null,null,null,null,"PRIMER TRIMESTRE"]
[null,"CICLO ESCOLAR :",null,null,null,null,null,null,null,null,null,null,null,"2021-2022"]
["DIRECCIÓN: ",null,null,"EDUCACIÓN SECUNDARIA"]
["DIRECTORA:",null,null,"MTRA. OFELIA ELIZABETH OCHOA ROMERO"]
[]
[]
["Modalidad","MATRÍCULA"]
[null,"INSCRIPCIÓN INICIAL ",null,null,null,null,null,null,null,null,null,null,null,"CAMBIOS DESDE OTRAS ESCUELAS (ALTAS)"]
[null,"PRIMERO",null,null,"SEGUNDO",null,null,"TERCERO",null,null,"TOTAL",null,null,"PRIMERO",null,null,"SEGUNDO",null,null,"TERCERO",null,null,"TOTAL"]
[null,"H","M","T","H","M","T","H","M","T","H","M","T","H","M","T","H","M","T","H","M","T","H","M","T"]
["Grales.",3426,3347,{"$f":"IF(SUM(B16,C16)=0,\"\",SUM(B16,C16))","v":6773},3416,3525,{"$f":"IF(SUM(E16,F16)=0,\"\",SUM(E16,F16))","v":6941},3264,3335,{"$f":"IF(SUM(H16,I16)=0,\"\",SUM(H16,I16))","v":6599},{"$f":"IF(SUM(B16,E16,H16)=0,\"\",SUM(B16,E16,H16))","v":10106},{"$f":"IF(SUM(C16,F16,I16)=0,\"\",SUM(SUM(C16,F16,I16)))","v":10207},{"$f":"IF(SUM(K16,L16)=0,\"\",SUM(K16,L16))","v":20313},25,25,{"$f":"IF(SUM(N16,O16)=0,\"\",SUM(N16,O16))","v":50},30,24,{"$f":"IF(SUM(Q16,R16)=0,\"\",SUM(Q16,R16))","v":54},21,31,{"$f":"IF(SUM(T16,U16)=0,\"\",SUM(T16,U16))","v":52},{"$f":"IF(SUM(N16,Q16,T16)=0,\"\",SUM(N16,Q16,T16))","v":76},{"$f":"IF(SUM(O16,R16,U16)=0,\"\",SUM(SUM(O16,R16,U16)))","v":80},{"$f":"IF(SUM(W16,X16)=0,\"\",SUM(W16,X16))","v":156}]
["Técs.",2605,2552,{"$f":"IF(SUM(B17,C17)=0,\"\",SUM(B17,C17))","v":5157},2604,2570,{"$f":"IF(SUM(E17,F17)=0,\"\",SUM(E17,F17))","v":5174},2570,2511,{"$f":"IF(SUM(H17,I17)=0,\"\",SUM(H17,I17))","v":5081},{"$f":"IF(SUM(B17,E17,H17)=0,\"\",SUM(B17,E17,H17))","v":7779},{"$f":"IF(SUM(C17,F17,I17)=0,\"\",SUM(SUM(C17,F17,I17)))","v":7633},{"$f":"IF(SUM(K17,L17)=0,\"\",SUM(K17,L17))","v":15412},26,23,{"$f":"IF(SUM(N17,O17)=0,\"\",SUM(N17,O17))","v":49},20,20,{"$f":"IF(SUM(Q17,R17)=0,\"\",SUM(Q17,R17))","v":40},13,18,{"$f":"IF(SUM(T17,U17)=0,\"\",SUM(T17,U17))","v":31},{"$f":"IF(SUM(N17,Q17,T17)=0,\"\",SUM(N17,Q17,T17))","v":59},{"$f":"IF(SUM(O17,R17,U17)=0,\"\",SUM(SUM(O17,R17,U17)))","v":61},{"$f":"IF(SUM(W17,X17)=0,\"\",SUM(W17,X17))","v":120}]
["Telesec.",953,827,1780,914,776,1690,885,849,1734,2752,2452,5204,6,3,9,8,8,16,8,10,18,22,21,43]
[null,null,null,"",null,null,"",null,null,"","","","",null,null,"",null,null,"",null,null,"","","",""]
[null,null,null,"",null,null,"",null,null,"","","","",null,null,"",null,null,"",null,null,"","","",""]
[null,null,null,"",null,null,"",null,null,"","","","",null,null,"",null,null,"",null,null,"","","",""]
[null,null,null,"",null,null,"",null,null,"","","","",null,null,"",null,null,"",null,null,"","","",""]
[null,null,null,"",null,null,"",null,null,"","","","",null,null,"",null,null,"",null,null,"","","",""]
[null,null,null,{"$f":"IF(SUM(B24,C24)=0,\"\",SUM(B24,C24))","v":""},null,null,{"$f":"IF(SUM(E24,F24)=0,\"\",SUM(E24,F24))","v":""},null,null,{"$f":"IF(SUM(H24,I24)=0,\"\",SUM(H24,I24))","v":""},{"$f":"IF(SUM(B24,E24,H24)=0,\"\",SUM(B24,E24,H24))","v":""},{"$f":"IF(SUM(C24,F24,I24)=0,\"\",SUM(SUM(C24,F24,I24)))","v":""},{"$f":"IF(SUM(K24,L24)=0,\"\",SUM(K24,L24))","v":""},null,null,{"$f":"IF(SUM(N24,O24)=0,\"\",SUM(N24,O24))","v":""},null,null,{"$f":"IF(SUM(Q24,R24)=0,\"\",SUM(Q24,R24))","v":""},null,null,{"$f":"IF(SUM(T24,U24)=0,\"\",SUM(T24,U24))","v":""},{"$f":"IF(SUM(N24,Q24,T24)=0,\"\",SUM(N24,Q24,T24))","v":""},{"$f":"IF(SUM(O24,R24,U24)=0,\"\",SUM(SUM(O24,R24,U24)))","v":""},{"$f":"IF(SUM(W24,X24)=0,\"\",SUM(W24,X24))","v":""}]
[null,null,null,"",null,null,"",null,null,"","","","",null,null,"",null,null,"",null,null,"","","",""]
["TOTAL",{"$f":"IF(SUM(B16:B25)=0,\"\",SUM(B16:B25))","v":6984},6726,13710,6934,6871,13805,6719,6695,13414,20637,20292,40929,57,51,108,58,52,110,42,59,101,157,162,319]
[]
["Modalidad","BAJAS",null,null,null,null,null,null,null,null,null,null,null,null,null,null,null,null,null,null,null,null,null,null,null,"EXISTENCIA"]
[null,"DESERCIÓN",null,null,null,null,null,null,null,null,null,null,null,"CAMBIOS HACIA OTRAS ESCUELAS (TRASLADOS)"]
[null,"PRIMERO",null,null,"SEGUNDO",null,null,"TERCERO",null,null,"TOTAL",null,null,"PRIMERO",null,null,"SEGUNDO",null,null,"TERCERO",null,null,"TOTAL",null,null,"PRIMERO",null,null,"SEGUNDO",null,null,"TERCERO",null,null,"TOTAL"]
[null,"H","M","T","H","M","T","H","M","T","H","M","T","H","M","T","H","M","T","H","M","T","H","M","T","H","M","T","H","M","T","H","M","T","H","M","T"]
[{"$f":"IF(A16=0,\"\",A16)","v":"Grales."},7,null,{"$f":"IF(SUM(B32,C32)=0,\"\",SUM(B32,C32))","v":7},4,4,{"$f":"IF(SUM(E32,F32)=0,\"\",SUM(E32,F32))","v":8},5,2,{"$f":"IF(SUM(H32,I32)=0,\"\",SUM(H32,I32))","v":7},{"$f":"IF(SUM(B32,E32,H32)=0,\"\",SUM(B32,E32,H32))","v":16},{"$f":"IF(SUM(C32,F32,I32)=0,\"\",SUM(SUM(C32,F32,I32)))","v":6},{"$f":"IF(SUM(K32,L32)=0,\"\",SUM(K32,L32))","v":22},27,19,{"$f":"IF(SUM(N32,O32)=0,\"\",SUM(N32,O32))","v":46},27,24,{"$f":"IF(SUM(Q32,R32)=0,\"\",SUM(Q32,R32))","v":51},27,32,{"$f":"IF(SUM(T32,U32)=0,\"\",SUM(T32,U32))","v":59},{"$f":"IF(SUM(N32,Q32,T32)=0,\"\",SUM(N32,Q32,T32))","v":81},{"$f":"IF(SUM(O32,R32,U32)=0,\"\",SUM(SUM(O32,R32,U32)))","v":75},{"$f":"IF(SUM(W32,X32)=0,\"\",SUM(W32,X32))","v":156},{"$f":"IF(SUM(B16,N16-B32-N32)=0,\"\",SUM(B16,N16-B32-N32))","v":3417},3353,{"$f":"IF(SUM(Z32,AA32)=0,\"\",SUM(Z32,AA32))","v":6770},{"$f":"IF(SUM(E16,Q16-E32-Q32)=0,\"\",SUM(E16,Q16-E32-Q32))","v":3415},3521,{"$f":"IF(SUM(AC32,AD32)=0,\"\",SUM(AC32,AD32))","v":6936},{"$f":"IF(SUM(H16,T16-H32-T32)=0,\"\",SUM(H16,T16-H32-T32))","v":3253},3332,{"$f":"IF(SUM(AF32,AG32)=0,\"\",SUM(AF32,AG32))","v":6585},{"$f":"IF(SUM(Z32,AC32,AF32)=0,\"\",SUM(Z32,AC32,AF32))","v":10085},{"$f":"IF(SUM(AA32,AD32,AG32)=0,\"\",SUM(SUM(AA32,AD32,AG32)))","v":10206},{"$f":"IF(SUM(AI32,AJ32)=0,\"\",SUM(AI32,AJ32))","v":20291}]
[{"$f":"IF(A17=0,\"\",A17)","v":"Técs."},null,4,{"$f":"IF(SUM(B33,C33)=0,\"\",SUM(B33,C33))","v":4},7,3,{"$f":"IF(SUM(E33,F33)=0,\"\",SUM(E33,F33))","v":10},9,4,{"$f":"IF(SUM(H33,I33)=0,\"\",SUM(H33,I33))","v":13},{"$f":"IF(SUM(B33,E33,H33)=0,\"\",SUM(B33,E33,H33))","v":16},{"$f":"IF(SUM(C33,F33,I33)=0,\"\",SUM(SUM(C33,F33,I33)))","v":11},{"$f":"IF(SUM(K33,L33)=0,\"\",SUM(K33,L33))","v":27},28,30,{"$f":"IF(SUM(N33,O33)=0,\"\",SUM(N33,O33))","v":58},26,27,{"$f":"IF(SUM(Q33,R33)=0,\"\",SUM(Q33,R33))","v":53},23,26,{"$f":"IF(SUM(T33,U33)=0,\"\",SUM(T33,U33))","v":49},{"$f":"IF(SUM(N33,Q33,T33)=0,\"\",SUM(N33,Q33,T33))","v":77},{"$f":"IF(SUM(O33,R33,U33)=0,\"\",SUM(SUM(O33,R33,U33)))","v":83},{"$f":"IF(SUM(W33,X33)=0,\"\",SUM(W33,X33))","v":160},2603,2541,5144,2591,2560,{"$f":"IF(SUM(AC33,AD33)=0,\"\",SUM(AC33,AD33))","v":5151},2551,2499,{"$f":"IF(SUM(AF33,AG33)=0,\"\",SUM(AF33,AG33))","v":5050},{"$f":"IF(SUM(Z33,AC33,AF33)=0,\"\",SUM(Z33,AC33,AF33))","v":7745},{"$f":"IF(SUM(AA33,AD33,AG33)=0,\"\",SUM(SUM(AA33,AD33,AG33)))","v":7600},{"$f":"IF(SUM(AI33,AJ33)=0,\"\",SUM(AI33,AJ33))","v":15345}]
[{"$f":"IF(A18=0,\"\",A18)","v":"Telesec."},1,null,1,3,1,4,4,3,7,8,4,12,11,13,24,9,10,19,12,14,26,32,37,69,947,817,1764,910,773,1683,877,842,1719,2734,2432,5166]
["TOTAL",{"$f":"IF(SUM(B32:B34)=0,\"\",SUM(B32:B34))","v":8},4,12,14,8,22,18,9,27,40,21,61,66,62,128,62,61,123,62,72,134,190,195,385,6967,6711,13678,6916,6854,13770,6681,6673,13354,20564,20238,40802]

{"sheet":"APROV 1","index":1,"n_rows":29,"n_cols":33,"rows_kept":29,"cut":false,"hidden":false,"merged":[[21,0,22,0],[21,4,21,6],[21,7,21,9],[21,16,21,18],[21,22,21,24],[6,1,6,12],[7,1,7,12],[6,13,6,25],[7,13,7,25],[21,1,21,3],[18,1,18,3],[18,7,18,9],[18,4,18,6],[20,25,20,30],[14,4,14,6],[12,25,12,30],[14,22,14,24],[17,4,17,6],[16,22,16,24],[16,25,16,27],[16,4,16,6],[20,31,20,32],[18,28,18,30],[21,28,21,30],[21,10,21,12],[21,13,21,15],[21,19,21,21],[21,25,21,27],[21,31,21,32],[18,10,18,12],[18,13,18,15],[18,19,18,21],[18,16,18,18],[18,25,18,27],[15,31,15,32],[13,0,14,0],[13,1,13,3],[13,4,13,6],[13,7,13,9],[13,10,13,12],[15,7,15,9],[15,22,15,24],[15,4,15,6],[14,1,14,3],[14,7,14,9],[13,19,13,21],[12,31,12,32],[14,13,14,15],[13,28,13,30],[14,28,14,30],[12,0,12,24],[13,31,13,32],[17,28,17,30],[17,22,17,24],[13,13,13,15],[13,16,13,18],[13,25,13,27],[14,25,14,27],[14,16,14,18],[13,22,13,24],[14,19,14,21],[15,13,15,15],[16,13,16,15],[15,28,15,30],[16,28,16,30],[15,19,15,21],[16,19,16,21],[28,0,30,32],[0,0,0,32],[2,1,2,29],[3,1,3,29],[4,1,4,29],[5,1,5,29],[9,0,9,2],[10,0,10,2],[20,0,20,24],[15,10,15,12],[16,10,16,12],[17,10,17,12],[15,1,15,3],[16,1,16,3],[17,13,17,15],[18,31,18,32],[10,3,10,31],[14,31,14,32],[14,10,14,12],[18,22,18,24],[9,3,9,31],[16,31,16,32],[17,31,17,32],[17,1,17,3],[15,25,15,27],[16,7,16,9],[15,16,15,18],[16,16,16,18],[17,16,17,18],[17,19,17,21],[17,7,17,9],[17,25,17,27]]}
[]
[]
[null,"Secretaría de Educación Pública del Estado de Baja California Sur"]
[null,"Dirección de Educación Secundaria"]
[null,"APROVECHAMIENTO Y RIESGO DE NO ACREDITAR"]
[null,"PRIMER GRADO"]
[null,"PERIODO EVALUACIÓN:",null,null,null,null,null,null,null,null,null,null,null,{"$f":"IF(MATRICULA!N6=0,\"\",MATRICULA!N6)","v":"PRIMER TRIMESTRE"}]
[null,"CICLO ESCOLAR :",null,null,null,null,null,null,null,null,null,null,null,{"$f":"IF(MATRICULA!N7=0,\"\",MATRICULA!N7)","v":"2021-2022"}]
[]
["DIRECCIÓN: ",null,null,{"$f":"IF(MATRICULA!D8=0,\"\",MATRICULA!D8)","v":"EDUCACIÓN SECUNDARIA"}]
["DIRECTORA:",null,null,{"$f":"MATRICULA!D9","v":"MTRA. OFELIA ELIZABETH OCHOA ROMERO"}]
[]
["Promedio de Aprovechamiento de los Campos de Formación Académica",null,null,null,null,null,null,null,null,null,null,null,null,null,null,null,null,null,null,null,null,null,null,null,null,"Promedio de Aprovechamiento de las Áreas de Desarrollo Personal y Social"]
["Modalidad","Lengua Materna",null,null,"Matemáticas",null,null,"Inglés",null,null,"Ciencias y tecnología (Biología)",null,null,"Historia",null,null,"Geografía",null,null,"Formación Cívica y Ética",null,null,"Tecnología I",null,null,"Educación Física",null,null,"Artes",null,null,"Prom. Final"]
[null,"CALIF",null,null,"CALIF",null,null,"CALIF",null,null,"CALIF",null,null,"CALIF",null,null,"CALIF",null,null,"CALIF",null,null,"CALIF",null,null,"CALIF",null,null,"CALIF",null,null,"CALIF"]
[{"$f":"IF(MATRICULA!A16=0,\"\",MATRICULA!A16)","v":"Grales."},8.5,null,null,8.5,null,null,8.6,null,null,8.6999999999999993,null,null,8.6999999999999993,null,null,8.6999999999999993,null,null,8.9,null,null,9,null,null,9.3000000000000007,null,null,9.1,null,null,{"$f":"IFERROR(ROUND(AVERAGE(B16:AE16),1),\"\")","v":8.8000000000000007}]
[{"$f":"IF(MATRICULA!A17=0,\"\",MATRICULA!A17)","v":"Técs."},8.4,null,null,8.5,null,null,8.6999999999999993,null,null,8.6999999999999993,null,null,8.4,null,null,8.6,null,null,8.6999999999999993,null,null,8.8000000000000007,null,null,9.5,null,null,9,null,null,8.6999999999999993]
[{"$f":"IF(MATRICULA!A18=0,\"\",MATRICULA!A18)","v":"Telesec."},8.3000000000000007,null,null,8.1999999999999993,null,null,8.4,null,null,8.3000000000000007,null,null,8.1999999999999993,null,null,8.3000000000000007,null,null,8.6999999999999993,null,null,9,null,null,9.1,null,null,9,null,null,8.6]
["Gral.",{"$f":"IFERROR(ROUND(AVERAGE(B16:D18),1),\"\")","v":8.4},null,null,{"$f":"IFERROR(ROUND(AVERAGE(E16:G18),1),\"\")","v":8.4},null,null,{"$f":"IFERROR(ROUND(AVERAGE(H16:J18),1),\"\")","v":8.6},null,null,{"$f":"IFERROR(ROUND(AVERAGE(K16:M18),1),\"\")","v":8.6},null,null,{"$f":"IFERROR(ROUND(AVERAGE(N16:P18),1),\"\")","v":8.4},null,null,{"$f":"IFERROR(ROUND(AVERAGE(Q16:S18),1),\"\")","v":8.5},null,null,{"$f":"IFERROR(ROUND(AVERAGE(T16:V18),1),\"\")","v":8.8000000000000007},null,null,{"$f":"IFERROR(ROUND(AVERAGE(W16:Y18),1),\"\")","v":8.9},null,null,{"$f":"IFERROR(ROUND(AVERAGE(Z16:AB18),1),\"\")","v":9.3000000000000007},null,null,{"$f":"IFERROR(ROUND(AVERAGE(AC16:AE18),1),\"\")","v":9},null,null,{"$f":"IFERROR(ROUND(AVERAGE(AF16:AG18),1),\"\")","v":8.6999999999999993}]
[]
["Campos de Formación Académica en riesgo de no acreditar",null,null,null,null,null,null,null,null,null,null,null,null,null,null,null,null,null,null,null,null,null,null,null,null,"Áreas de Desarrollo Personal y Social en riesgo de no acreditar"]
["Modalidad","Lengua Materna",null,null,"Matemáticas",null,null,"Inglés",null,null,"Ciencias y tecnología (Biología)",null,null,"Historia",null,null,"Geografía",null,null,"Formación Cívica y Ética",null,null,"Tecnología I",null,null,"Educación Física",null,null,"Artes",null,null,"Total"]
[null,5,6,"T",5,6,"T",5,6,"T",5,6,"T",5,6,"T",5,6,"T",5,6,"T",5,6,"T",5,6,"T",5,6,"T",5,6]
[{"$f":"IF(MATRICULA!A16=0,\"\",MATRICULA!A16)","v":"Grales."},null,540,{"$f":"IF(SUM(B24,C24)=0,\"\",SUM(B24,C24))","v":540},null,580,{"$f":"IF(SUM(E24,F24)=0,\"\",SUM(E24,F24))","v":580},null,373,{"$f":"IF(SUM(H24,I24)=0,\"\",SUM(H24,I24))","v":373},null,295,{"$f":"IF(SUM(K24,L24)=0,\"\",SUM(K24,L24))","v":295},null,380,{"$f":"IF(SUM(N24,O24)=0,\"\",SUM(N24,O24))","v":380},null,364,{"$f":"IF(SUM(Q24,R24)=0,\"\",SUM(Q24,R24))","v":364},null,332,{"$f":"IF(SUM(T24,U24)=0,\"\",SUM(T24,U24))","v":332},null,220,{"$f":"IF(SUM(W24,X24)=0,\"\",SUM(W24,X24))","v":220},null,243,{"$f":"IF(SUM(Z24,AA24)=0,\"\",SUM(Z24,AA24))","v":243},null,231,{"$f":"IF(SUM(AC24,AD24)=0,\"\",SUM(AC24,AD24))","v":231},{"$f":"IF(SUM(B24,E24,H24,K24,N24,Q24,T24,W24,Z24,AC24)=0,\"\",SUM(B24,E24,H24,K24,N24,Q24,T24,W24,Z24,AC24))","v":""},{"$f":"IF(SUM(C24,F24,I24,L24,O24,R24,U24,X24,AA24,AD24)=0,\"\",SUM(C24,F24,I24,L24,O24,R24,U24,X24,AA24,AD24))","v":3558}]
[{"$f":"IF(MATRICULA!A17=0,\"\",MATRICULA!A17)","v":"Técs."},null,657,657,null,514,{"$f":"IF(SUM(E25,F25)=0,\"\",SUM(E25,F25))","v":514},null,393,{"$f":"IF(SUM(H25,I25)=0,\"\",SUM(H25,I25))","v":393},null,632,{"$f":"IF(SUM(K25,L25)=0,\"\",SUM(K25,L25))","v":632},null,734,{"$f":"IF(SUM(N25,O25)=0,\"\",SUM(N25,O25))","v":734},null,423,{"$f":"IF(SUM(Q25,R25)=0,\"\",SUM(Q25,R25))","v":423},null,570,{"$f":"IF(SUM(T25,U25)=0,\"\",SUM(T25,U25))","v":570},null,653,{"$f":"IF(SUM(W25,X25)=0,\"\",SUM(W25,X25))","v":653},null,265,{"$f":"IF(SUM(Z25,AA25)=0,\"\",SUM(Z25,AA25))","v":265},null,489,{"$f":"IF(SUM(AC25,AD25)=0,\"\",SUM(AC25,AD25))","v":489},{"$f":"IF(SUM(B25,E25,H25,K25,N25,Q25,T25,W25,Z25,AC25)=0,\"\",SUM(B25,E25,H25,K25,N25,Q25,T25,W25,Z25,AC25))","v":""},{"$f":"IF(SUM(C25,F25,I25,L25,O25,R25,U25,X25,AA25,AD25)=0,\"\",SUM(C25,F25,I25,L25,O25,R25,U25,X25,AA25,AD25))","v":5330}]
[{"$f":"IF(MATRICULA!A18=0,\"\",MATRICULA!A18)","v":"Telesec."},null,161,161,null,196,196,null,209,{"$f":"IF(SUM(H26,I26)=0,\"\",SUM(H26,I26))","v":209},null,169,169,null,184,184,null,163,163,null,166,166,null,148,148,null,177,177,null,156,156,{"$f":"IF(SUM(B26,E26,H26,K26,N26,Q26,T26,W26,Z26,AC26)=0,\"\",SUM(B26,E26,H26,K26,N26,Q26,T26,W26,Z26,AC26))","v":""},1729]
["Total",{"$f":"IF(SUM(B24:B26)=0,\"\",SUM(B24:B26))","v":""},1358,1358,"",1290,1290,"",975,975,"",1096,1096,"",1298,1298,"",950,950,"",1068,1068,"",1021,1021,"",685,685,"",876,876,"",10617]
[]
["Nota: Para las columnas \"Campos de Formación Académica y Áreas de Desarrollo Personal y Social en riesgo de no acreditar\" registre la cantidad de cincos o seis que existen en cada campo o área."]

{"sheet":"PARTICIPACIÓN 1","index":2,"n_rows":18,"n_cols":28,"rows_kept":18,"cut":false,"hidden":false,"merged":[[15,27,15,29],[16,27,16,29],[15,23,15,26],[16,23,16,26],[17,23,17,26],[17,21,17,22],[11,0,11,29],[14,0,14,2],[12,19,12,22],[14,27,14,29],[12,23,13,26],[12,27,13,29],[12,3,12,6],[12,11,12,14],[13,5,13,6],[14,5,14,6],[13,21,13,22],[14,13,14,14],[14,7,14,10],[14,23,14,26],[17,27,17,29],[7,13,7,22],[8,0,8,2],[8,3,8,28],[9,0,9,2],[7,1,7,11],[9,3,9,28],[2,1,2,26],[3,1,3,26],[4,1,4,26],[5,1,5,26],[6,13,6,22],[6,1,6,11],[17,5,17,6],[12,0,13,2],[12,15,13,18],[12,7,13,10],[17,13,17,14],[15,0,15,2],[14,15,14,18],[13,13,13,14],[17,0,17,2],[15,7,15,10],[16,7,16,10],[17,7,17,10],[16,5,16,6],[16,0,16,2],[15,5,15,6],[17,15,17,18],[15,13,15,14],[16,13,16,14],[14,21,14,22],[15,21,15,22],[16,21,16,22],[15,15,15,18],[16,15,16,18]]}
[]
[]
[null,"Secretaría de Educación Pública del Estado de Baja California Sur"]
[null,"Dirección de Educación Secundaria"]
[null,"NIVELES DE COMUNICACIÓN Y PARTICIPACIÓN DE ALUMNOS"]
[null,"PRIMER GRADO "]
[null,"PERIODO EVALUACIÓN:",null,null,null,null,null,null,null,null,null,null,null,{"$f":"IF('APROV 1'!N7:Z7<>0,'APROV 1'!N7:Z7, \"\")","v":"PRIMER TRIMESTRE"}]
[null,"CICLO ESCOLAR :",null,null,null,null,null,null,null,null,null,null,null,{"$f":"IF('APROV 1'!N8:Z8<>0,'APROV 1'!N8:Z8, \"\")","v":"2021-2022"}]
["DIRECCIÓN:",null,null,{"$f":"IF('APROV 1'!D10:AF10<>0,'APROV 1'!D10:AF10, \"\")","v":"EDUCACIÓN SECUNDARIA"}]
["DIRECTORA:",null,null,{"$f":"'APROV 1'!D11:AF11","v":"MTRA. OFELIA ELIZABETH OCHOA ROMERO"}]
[]
[" COMUNICACIÓN Y PARTICIPACIÓN CON ALUMNOS  (Registrar cantidad de alumnos)"]
["Modalidad",null,null,"COMUNICACIÓN Y PARTICIPACIÓN SOSTENIDA",null,null,null,"%",null,null,null,"COMUNICACIÓN Y PARTICIPACIÓN INTERMITENTE",null,null,null,"%",null,null,null,"COMUNICACIÓN PRACTICAMENTE INEXISTENTE",null,null,null,"%",null,null,null,"MATRÍCULA\nEXISTENCIA"]
[null,null,null,"PRESENCIAL","VIRTUAL","A DISTANCIA",null,null,null,null,null,"PRESENCIAL","VIRTUAL","A DISTANCIA",null,null,null,null,null,"PRESENCIAL","VIRTUAL","A DISTANCIA"]
[{"$f":"IF(MATRICULA!A16=0,\"\",MATRICULA!A16)","v":"Grales."},null,null,3415,1076,549,null,{"$f":"IFERROR((D15+E15+F15)/AB15*100,\"\")","v":74.446085672082717},null,null,null,704,551,129,null,{"$f":"IFERROR((L15+M15+N15)/AB15*100,\"\")","v":20.443131462333824},null,null,null,123,126,97,null,{"$f":"IFERROR((T15+U15+V15)/AB15*100,\"\")","v":5.110782865583456},null,null,null,{"$f":"IF(MATRICULA!AB32=0,\"\",MATRICULA!AB32)","v":6770}]
[{"$f":"IF(MATRICULA!A17=0,\"\",MATRICULA!A17)","v":"Técs."},null,null,2929,306,249,null,{"$f":"IFERROR((D16+E16+F16)/AB16*100,\"\")","v":67.72939346811819},null,null,null,981,133,349,null,{"$f":"IFERROR((L16+M16+N16)/AB16*100,\"\")","v":28.440902021772942},null,null,null,40,1,156,null,{"$f":"IFERROR((T16+U16+V16)/AB16*100,\"\")","v":3.8297045101088645},null,null,null,{"$f":"IF(MATRICULA!AB33=0,\"\",MATRICULA!AB33)","v":5144}]
[{"$f":"IF(MATRICULA!A18=0,\"\",MATRICULA!A18)","v":"Telesec."},null,null,1022,351,204,null,89.399092970521536,null,null,null,79,41,37,null,8.9002267573696141,null,null,null,14,4,12,null,1.7006802721088436,null,null,null,{"$f":"IF(MATRICULA!AB34=0,\"\",MATRICULA!AB34)","v":1764}]
["TOTAL",null,null,{"$f":"SUM(D15:D17)","v":7366},{"$f":"SUM(E15:E17)","v":1733},{"$f":"SUM(F15:G17)","v":1002},null,73.848515864892534,null,null,null,{"$f":"SUM(L15:L17)","v":1764},{"$f":"SUM(M15:M17)","v":725},{"$f":"SUM(N15:O17)","v":515},null,21.962275186430766,null,null,null,{"$f":"SUM(T15:T17)","v":177},{"$f":"SUM(U15:U17)","v":131},{"$f":"SUM(V15:W17)","v":265},null,4.1892089486767068,null,null,null,{"$f":"SUM(AB15:AD17)","v":13678}]

{"sheet":"Gráfica APROV 1","index":3,"n_rows":13,"n_cols":14,"rows_kept":13,"cut":false,"hidden":false,"merged":[[6,1,6,12],[6,13,6,25],[11,0,30,0],[0,0,0,32],[2,1,2,29],[3,1,3,29],[4,1,4,29],[8,0,8,2],[8,3,8,31],[9,0,9,2],[5,1,5,12],[5,13,5,25],[9,3,9,31]]}
[]
[]
[null,"Secretaría de Educación Pública del Estado de Baja California Sur"]
[null,"Dirección de Educación Secundaria"]
[null,"PRIMER GRADO "]
[null,"PERIODO EVALUACIÓN:",null,null,null,null,null,null,null,null,null,null,null,{"$f":"IF('APROV 1'!N7:Z7<>0,'APROV 1'!N7:Z7, \"\")","v":"PRIMER TRIMESTRE"}]
[null,"CICLO ESCOLAR :",null,null,null,null,null,null,null,null,null,null,null,{"$f":"IF('APROV 1'!N8:Z8<>0,'APROV 1'!N8:Z8, \"\")","v":"2021-2022"}]
[]
["DIRECCIÓN: ",null,null,{"$f":"IF('APROV 1'!D10:AF10<>0,'APROV 1'!D10:AF10, \"\")","v":"EDUCACIÓN SECUNDARIA"}]
["DIRECTORA:",null,null,{"$f":"'PARTICIPACIÓN 1'!D10:AC10","v":"MTRA. OFELIA ELIZABETH OCHOA ROMERO"}]
[]
[null,"Lengua Materna ","Matemáticas","Inglés","Ciencias y tecnología (Biología)","Historia","Geografía","Formación Cívica y Ética","Tecnología I","Educación Física","Artes"]
[null,{"$f":"'APROV 1'!B19:D19","v":8.4},{"$f":"'APROV 1'!E19","v":8.4},{"$f":"'APROV 1'!H19","v":8.6},{"$f":"'APROV 1'!K19","v":8.6},{"$f":"'APROV 1'!N19","v":8.4},{"$f":"'APROV 1'!Q19","v":8.5},{"$f":"'APROV 1'!T19","v":8.8000000000000007},{"$f":"'APROV 1'!W19","v":8.9},{"$f":"'APROV 1'!Z19","v":9.3000000000000007},{"$f":"'APROV 1'!AC19","v":9}]

{"sheet":"Gráfica PART 1","index":4,"n_rows":14,"n_cols":14,"rows_kept":14,"cut":false,"hidden":false,"merged":[[0,0,0,32],[2,1,2,29],[3,1,3,29],[4,1,4,29],[5,1,5,12],[5,13,5,25],[11,0,30,0],[6,1,6,12],[6,13,6,25],[8,0,8,2],[8,3,8,31],[9,0,9,2],[9,3,9,31]]}
[]
[]
[null,"Secretaría de Educación Pública del Estado de Baja California Sur"]
[null,"Dirección de Educación Secundaria"]
[null,"PRIMER GRADO "]
[null,"PERIODO EVALUACIÓN:",null,null,null,null,null,null,null,null,null,null,null,{"$f":"IF('APROV 1'!N7:Z7<>0,'APROV 1'!N7:Z7, \"\")","v":"PRIMER TRIMESTRE"}]
[null,"CICLO ESCOLAR :",null,null,null,null,null,null,null,null,null,null,null,{"$f":"IF('APROV 1'!N8:Z8<>0,'APROV 1'!N8:Z8, \"\")","v":"2021-2022"}]
[]
["DIRECCIÓN: ",null,null,{"$f":"IF('APROV 1'!D10:AF10<>0,'APROV 1'!D10:AF10, \"\")","v":"EDUCACIÓN SECUNDARIA"}]
["DIRECTORA:",null,null,{"$f":"'Gráfica APROV 1'!D10:AF10","v":"MTRA. OFELIA ELIZABETH OCHOA ROMERO"}]
[]
[]
[null,{"$f":"'APROV 1'!B19:D19","v":8.4},{"$f":"'APROV 1'!E19","v":8.4},"COMUNICACIÓN Y PARTICIPACIÓN SOSTENIDA","COMUNICACIÓN Y PARTICIPACIÓN INTERMITENTE","COMUNICACIÓN PRACTICAMENTE INEXISTENTE",null,null,null,{"$f":"'APROV 1'!Z19","v":9.3000000000000007},{"$f":"'APROV 1'!AC19","v":9}]
[null,null,null,{"$f":"'PARTICIPACIÓN 1'!H18/100","v":0.73848515864892539},{"$f":"'PARTICIPACIÓN 1'!P18/100","v":0.21962275186430766},{"$f":"'PARTICIPACIÓN 1'!X18/100","v":4.1892089486767065E-2}]

{"sheet":"APROV 2","index":5,"n_rows":28,"n_cols":30,"rows_kept":28,"cut":false,"hidden":false,"merged":[[11,28,11,29],[11,22,11,27],[19,22,19,27],[13,7,13,9],[12,19,12,21],[13,13,13,15],[13,16,13,18],[13,19,13,21],[14,25,14,27],[16,28,16,29],[13,10,13,12],[14,10,14,12],[15,10,15,12],[12,10,12,12],[12,13,12,15],[13,28,13,29],[27,0,28,29],[20,28,20,29],[19,28,19,29],[17,28,17,29],[16,25,16,27],[16,10,16,12],[16,16,16,18],[16,19,16,21],[20,25,20,27],[17,13,17,15],[17,25,17,27],[17,16,17,18],[17,22,17,24],[20,16,20,18],[20,22,20,24],[20,10,20,12],[15,25,15,27],[14,28,14,29],[15,28,15,29],[12,28,12,29],[14,16,14,18],[15,16,15,18],[14,19,14,21],[15,19,15,21],[12,22,12,24],[13,22,13,24],[14,22,14,24],[15,22,15,24],[12,25,12,27],[13,25,13,27],[12,16,12,18],[20,0,21,0],[20,1,20,3],[20,4,20,6],[20,7,20,9],[16,1,16,3],[19,0,19,21],[17,19,17,21],[20,13,20,15],[17,10,17,12],[17,1,17,3],[17,4,17,6],[17,7,17,9],[20,19,20,21],[14,4,14,6],[15,4,15,6],[16,4,16,6],[13,1,13,3],[11,0,11,21],[14,1,14,3],[15,1,15,3],[12,0,13,0],[12,1,12,3],[12,4,12,6],[12,7,12,9],[13,4,13,6],[16,22,16,24],[14,7,14,9],[15,7,15,9],[16,7,16,9],[14,13,14,15],[15,13,15,15],[16,13,16,15],[8,0,8,2],[9,0,9,2],[2,1,2,26],[3,1,3,26],[5,1,5,26],[8,3,8,28],[6,1,6,12],[7,1,7,12],[6,13,6,22],[7,13,7,22],[4,1,4,26],[9,3,9,28]]}
[]
[]
[null,"Secretaría de Educación Pública del Estado de Baja California Sur"]
[null,"Dirección de Educación Secundaria"]
[null,"APROVECHAMIENTO Y RIESGO DE NO ACREDITAR"]
[null,"SEGUNDO GRADO "]
[null,"PERIODO EVALUACIÓN:",null,null,null,null,null,null,null,null,null,null,null,{"$f":"IF('APROV 1'!N7:Z7<>0,'APROV 1'!N7:Z7, \"\")","v":"PRIMER TRIMESTRE"}]
[null,"CICLO ESCOLAR :",null,null,null,null,null,null,null,null,null,null,null,{"$f":"IF('APROV 1'!N8:Z8<>0,'APROV 1'!N8:Z8, \"\")","v":"2021-2022"}]
["DIRECCIÓN: ",null,null,{"$f":"IF('APROV 1'!D10:AF10<>0,'APROV 1'!D10:AF10, \"\")","v":"EDUCACIÓN SECUNDARIA"}]
["DIRECTORA:",null,null,{"$f":"'Gráfica PART 1'!D10:AF10","v":"MTRA. OFELIA ELIZABETH OCHOA ROMERO"}]
[]
["Promedio de Aprovechamiento de los Campos de Formación Académica",null,null,null,null,null,null,null,null,null,null,null,null,null,null,null,null,null,null,null,null,null,"Promedio de Aprovechamiento de las Áreas de Desarrollo Personal y Social"]
["Modalidad","Lengua Materna ",null,null,"Matemáticas",null,null,"Inglés",null,null,"Ciencias y Tecnología  (Física)",null,null,"Historia ",null,null,"Formación Cívica y Ética",null,null,"Tecnología II",null,null,"Educación Física",null,null,"Artes",null,null,"Prom. Final"]
[null,"CALIF",null,null,"CALIF",null,null,"CALIF",null,null,"CALIF",null,null,"CALIF",null,null,"CALIF",null,null,"CALIF",null,null,"CALIF",null,null,"CALIF",null,null,"CALIF"]
[{"$f":"IF(MATRICULA!A16=0,\"\",MATRICULA!A16)","v":"Grales."},8.5,null,null,8.4,null,null,8.6,null,null,8.4,null,null,8.6,null,null,8.8000000000000007,null,null,8.8000000000000007,null,null,9.3000000000000007,null,null,9,null,null,{"$f":"IFERROR(ROUND(AVERAGE(B15:AB15),1),\"\")","v":8.6999999999999993}]
[{"$f":"IF(MATRICULA!A17=0,\"\",MATRICULA!A17)","v":"Técs."},8.5,null,null,8.6,null,null,8.6999999999999993,null,null,8.5,null,null,8.6,null,null,8.6999999999999993,null,null,8.6999999999999993,null,null,9.3000000000000007,null,null,9,null,null,8.6999999999999993]
[{"$f":"IF(MATRICULA!A18=0,\"\",MATRICULA!A18)","v":"Telesec."},8.4,null,null,8.1999999999999993,null,null,8.3000000000000007,null,null,8.3000000000000007,null,null,8.3000000000000007,null,null,8.6,null,null,8.9,null,null,9.1,null,null,8.9,null,null,8.6]
["Gral.",{"$f":"IFERROR(ROUND(AVERAGE(B15:D17),1),\"\")","v":8.5},null,null,{"$f":"IFERROR(ROUND(AVERAGE(E15:G17),1),\"\")","v":8.4},null,null,{"$f":"IFERROR(ROUND(AVERAGE(H15:J17),1),\"\")","v":8.5},null,null,{"$f":"IFERROR(ROUND(AVERAGE(K15:M17),1),\"\")","v":8.4},null,null,{"$f":"IFERROR(ROUND(AVERAGE(N15:P17),1),\"\")","v":8.5},null,null,{"$f":"IFERROR(ROUND(AVERAGE(Q15:S17),1),\"\")","v":8.6999999999999993},null,null,{"$f":"IFERROR(ROUND(AVERAGE(T15:V17),1),\"\")","v":8.8000000000000007},null,null,{"$f":"IFERROR(ROUND(AVERAGE(W15:Y17),1),\"\")","v":9.1999999999999993},null,null,{"$f":"IFERROR(ROUND(AVERAGE(Z15:AB17),1),\"\")","v":9},null,null,{"$f":"IFERROR(ROUND(AVERAGE(AC15:AD17),1),\"\")","v":8.6999999999999993}]
[]
["Campos de Formación Académica en situacion de riesgo de no acreditar",null,null,null,null,null,null,null,null,null,null,null,null,null,null,null,null,null,null,null,null,null,"Áreas de Desarrollo Personal y Social en situacion de riesgo de no acreditar"]
["Modalidad","Lengua Materna ",null,null,"Matemáticas",null,null,"Inglés",null,null,"Ciencias y Tecnología  (Física)",null,null,"Historia ",null,null,"Formación Cívica y Ética",null,null,"Tecnología II",null,null,"Educación Física",null,null,"Artes",null,null,"Total"]
[null,5,6,"T",5,6,"T",5,6,"T",5,6,"T",5,6,"T",5,6,"T",5,6,"T",5,6,"T",5,6,"T",5,6]
[{"$f":"IF(MATRICULA!A16=0,\"\",MATRICULA!A16)","v":"Grales."},null,542,{"$f":"IF(SUM(B23,C23)=0,\"\",SUM(B23,C23))","v":542},null,502,{"$f":"IF(SUM(E23,F23)=0,\"\",SUM(E23,F23))","v":502},null,500,{"$f":"IF(SUM(H23,I23)=0,\"\",SUM(H23,I23))","v":500},null,524,{"$f":"IF(SUM(K23,L23)=0,\"\",SUM(K23,L23))","v":524},null,493,{"$f":"IF(SUM(N23,O23)=0,\"\",SUM(N23,O23))","v":493},null,400,{"$f":"IF(SUM(Q23,R23)=0,\"\",SUM(Q23,R23))","v":400},null,348,{"$f":"IF(SUM(T23,U23)=0,\"\",SUM(T23,U23))","v":348},null,299,{"$f":"IF(SUM(W23,X23)=0,\"\",SUM(W23,X23))","v":299},null,247,{"$f":"IF(SUM(Z23,AA23)=0,\"\",SUM(Z23,AA23))","v":247},{"$f":"IF(SUM(B23,E23,H23,K23,N23,Q23,T23,W23,Z23)=0,\"\",SUM(B23,E23,H23,K23,N23,Q23,T23,W23,Z23))","v":""},{"$f":"IF(SUM(C23,F23,I23,L23,O23,R23,U23,X23,AA23)=0,\"\",SUM(C23,F23,I23,L23,O23,R23,U23,X23,AA23))","v":3855}]
[{"$f":"IF(MATRICULA!A17=0,\"\",MATRICULA!A17)","v":"Técs."},null,625,625,null,491,491,null,421,421,null,527,527,null,503,503,null,574,574,null,613,613,null,302,302,null,492,492,"",4548]
[{"$f":"IF(MATRICULA!A18=0,\"\",MATRICULA!A18)","v":"Telesec."},null,125,125,null,154,154,null,144,144,null,141,141,null,140,140,null,137,137,null,105,105,null,139,139,null,130,130,"",1215]
["Total",{"$f":"IF(SUM(B23:B25)=0,\"\",SUM(B23:B25))","v":""},1292,1292,"",1147,1147,"",1065,1065,"",1192,1192,"",1136,1136,"",1111,1111,"",1066,1066,"",740,740,"",869,869,"",9618]
[]
["Nota: Para las columnas \"Campos de Formación Académica y Áreas de Desarrollo Personal y Social en riesgo de no acreditar\" registre la cantidad de cincos o seis que existen en cada campo o área."]

{"sheet":"PARTICIPACIÓN 2","index":6,"n_rows":18,"n_cols":28,"rows_kept":18,"cut":false,"hidden":false,"merged":[[17,21,17,22],[17,23,17,26],[17,27,17,29],[17,0,17,2],[17,5,17,6],[17,7,17,10],[17,13,17,14],[17,15,17,18],[16,23,16,26],[16,27,16,29],[16,0,16,2],[16,5,16,6],[16,7,16,10],[16,13,16,14],[16,15,16,18],[16,21,16,22],[14,21,14,22],[14,23,14,26],[14,27,14,29],[15,0,15,2],[15,5,15,6],[15,7,15,10],[15,13,15,14],[15,15,15,18],[15,21,15,22],[15,23,15,26],[15,27,15,29],[14,0,14,2],[14,5,14,6],[14,7,14,10],[14,13,14,14],[14,15,14,18],[11,0,11,29],[12,0,13,2],[12,3,12,6],[12,7,13,10],[12,11,12,14],[12,15,13,18],[12,19,12,22],[12,23,13,26],[12,27,13,29],[13,5,13,6],[13,13,13,14],[13,21,13,22],[7,1,7,12],[7,13,7,22],[8,0,8,2],[8,3,8,28],[9,0,9,2],[9,3,9,28],[2,1,2,26],[3,1,3,26],[4,1,4,26],[5,1,5,26],[6,1,6,12],[6,13,6,22]]}
[]
[]
[null,"Secretaría de Educación Pública del Estado de Baja California Sur"]
[null,"Dirección de Educación Secundaria"]
[null,"NIVELES DE COMUNICACIÓN Y PARTICIPACIÓN DE ALUMNOS"]
[null,"SEGUNDO GRADO "]
[null,"PERIODO EVALUACIÓN:",null,null,null,null,null,null,null,null,null,null,null,{"$f":"IF('APROV 1'!N7:Z7<>0,'APROV 1'!N7:Z7, \"\")","v":"PRIMER TRIMESTRE"}]
[null,"CICLO ESCOLAR :",null,null,null,null,null,null,null,null,null,null,null,{"$f":"IF('APROV 1'!N8:Z8<>0,'APROV 1'!N8:Z8, \"\")","v":"2021-2022"}]
["DIRECCIÓN:",null,null,{"$f":"IF('APROV 1'!D10:AF10<>0,'APROV 1'!D10:AF10, \"\")","v":"EDUCACIÓN SECUNDARIA"}]
["DIRECTORA:",null,null,{"$f":"'APROV 2'!D10:AC10","v":"MTRA. OFELIA ELIZABETH OCHOA ROMERO"}]
[]
[" COMUNICACIÓN Y PARTICIPACIÓN CON ALUMNOS  (Registrar cantidad de alumnos)"]
["Modalidad",null,null,"COMUNICACIÓN Y PARTICIPACIÓN SOSTENIDA",null,null,null,"%",null,null,null,"COMUNICACIÓN Y PARTICIPACIÓN INTERMITENTE",null,null,null,"%",null,null,null,"COMUNICACIÓN PRACTICAMENTE INEXISTENTE",null,null,null,"%",null,null,null,"MATRÍCULA\nEXISTENCIA"]
[null,null,null,"PRESENCIAL","VIRTUAL","A DISTANCIA",null,null,null,null,null,"PRESENCIAL","VIRTUAL","A DISTANCIA",null,null,null,null,null,"PRESENCIAL","VIRTUAL","A DISTANCIA"]
[{"$f":"IF(MATRICULA!A16=0,\"\",MATRICULA!A16)","v":"Grales."},null,null,3388,970,674,null,{"$f":"IFERROR((D15+E15+F15)/AB15*100,\"\")","v":72.549019607843135},null,null,null,699,705,166,null,{"$f":"IFERROR((L15+M15+N15)/AB15*100,\"\")","v":22.635524798154556},null,null,null,116,127,91,null,{"$f":"IFERROR((T15+U15+V15)/AB15*100,\"\")","v":4.8154555940023069},null,null,null,{"$f":"IF(MATRICULA!AE32=0,\"\",MATRICULA!AE32)","v":6936}]
[{"$f":"IF(MATRICULA!A17=0,\"\",MATRICULA!A17)","v":"Técs."},null,null,2941,212,314,null,{"$f":"IFERROR((D16+E16+F16)/AB16*100,\"\")","v":67.307318967190838},null,null,null,941,189,326,null,{"$f":"IFERROR((L16+M16+N16)/AB16*100,\"\")","v":28.266356047369445},null,null,null,47,8,173,null,{"$f":"IFERROR((T16+U16+V16)/AB16*100,\"\")","v":4.4263249854397202},null,null,null,{"$f":"IF(MATRICULA!AE33=0,\"\",MATRICULA!AE33)","v":5151}]
[{"$f":"IF(MATRICULA!A18=0,\"\",MATRICULA!A18)","v":"Telesec."},null,null,1037,261,155,null,86.333927510398098,null,null,null,74,55,28,null,9.3285799168152099,null,null,null,24,34,15,null,4.3374925727866911,null,null,null,{"$f":"IF(MATRICULA!AE34=0,\"\",MATRICULA!AE34)","v":1683}]
["TOTAL",null,null,{"$f":"SUM(D15:D17)","v":7366},{"$f":"SUM(E15:E17)","v":1443},{"$f":"SUM(F15:G17)","v":1143},null,72.273057371096584,null,null,null,{"$f":"SUM(L15:L17)","v":1714},{"$f":"SUM(M15:M17)","v":949},{"$f":"SUM(N15:O17)","v":520},null,23.115468409586057,null,null,null,{"$f":"SUM(T15:T17)","v":187},{"$f":"SUM(U15:U17)","v":169},{"$f":"SUM(V15:W17)","v":279},null,4.6114742193173566,null,null,null,{"$f":"SUM(AB15:AD17)","v":13770}]

{"sheet":"Gráfica APROV 2","index":7,"n_rows":14,"n_cols":14,"rows_kept":14,"cut":false,"hidden":false,"merged":[[2,1,2,26],[3,1,3,26],[4,1,4,26],[5,1,5,12],[6,1,6,12],[7,0,7,2],[7,3,7,28],[8,0,8,2],[8,3,8,28],[5,13,5,23],[6,13,6,23]]}
[]
[]
[null,"Secretaría de Educación Pública del Estado de Baja California Sur"]
[null,"Dirección de Educación Secundaria"]
[null,"SEGUNDO GRADO"]
[null,"PERIODO EVALUACIÓN:",null,null,null,null,null,null,null,null,null,null,null,{"$f":"IF('APROV 1'!N7:Z7<>0,'APROV 1'!N7:Z7, \"\")","v":"PRIMER TRIMESTRE"}]
[null,"CICLO ESCOLAR :",null,null,null,null,null,null,null,null,null,null,null,{"$f":"IF('APROV 1'!N8:Z8<>0,'APROV 1'!N8:Z8, \"\")","v":"2021-2022"}]
["DIRECCIÓN: ",null,null,{"$f":"IF('APROV 1'!D10:AF10<>0,'APROV 1'!D10:AF10, \"\")","v":"EDUCACIÓN SECUNDARIA"}]
["DIRECTORA:",null,null,{"$f":"'PARTICIPACIÓN 2'!D10:AC10","v":"MTRA. OFELIA ELIZABETH OCHOA ROMERO"}]
[]
[]
[]
[null,"Lengua Materna ","Matemáticas","Inglés","Ciencias y Tecnología  (Física)","Historia ","Formación Cívica y Ética ","Tecnología II","Educación Física","Artes"]
[null,{"$f":"'APROV 2'!B18:D18","v":8.5},{"$f":"'APROV 2'!E18","v":8.4},{"$f":"'APROV 2'!H18","v":8.5},{"$f":"'APROV 2'!K18","v":8.4},{"$f":"'APROV 2'!N18","v":8.5},{"$f":"'APROV 2'!Q18","v":8.6999999999999993},{"$f":"'APROV 2'!T18","v":8.8000000000000007},{"$f":"'APROV 2'!W18","v":9.1999999999999993},{"$f":"'APROV 2'!Z18","v":9}]

{"sheet":"Gráfica PART 2","index":8,"n_rows":14,"n_cols":14,"rows_kept":14,"cut":false,"hidden":false,"merged":[[11,0,30,0],[6,1,6,12],[6,13,6,25],[8,0,8,2],[8,3,8,31],[9,0,9,2],[9,3,9,31],[0,0,0,32],[2,1,2,29],[3,1,3,29],[4,1,4,29],[5,1,5,12],[5,13,5,25]]}
[]
[]
[null,"Secretaría de Educación Pública del Estado de Baja California Sur"]
[null,"Dirección de Educación Secundaria"]
[null,"SEGUNDO GRADO "]
[null,"PERIODO EVALUACIÓN:",null,null,null,null,null,null,null,null,null,null,null,{"$f":"IF('APROV 1'!N7:Z7<>0,'APROV 1'!N7:Z7, \"\")","v":"PRIMER TRIMESTRE"}]
[null,"CICLO ESCOLAR :",null,null,null,null,null,null,null,null,null,null,null,{"$f":"IF('APROV 1'!N8:Z8<>0,'APROV 1'!N8:Z8, \"\")","v":"2021-2022"}]
[]
["DIRECCIÓN:",null,null,{"$f":"IF('APROV 1'!D10:AF10<>0,'APROV 1'!D10:AF10, \"\")","v":"EDUCACIÓN SECUNDARIA"}]
["DIRECTOR:",null,null,{"$f":"'Gráfica APROV 2'!D9:AC9","v":"MTRA. OFELIA ELIZABETH OCHOA ROMERO"}]
[]
[]
[null,{"$f":"'APROV 1'!B19:D19","v":8.4},{"$f":"'APROV 1'!E19","v":8.4},"COMUNICACIÓN Y PARTICIPACIÓN SOSTENIDA","COMUNICACIÓN Y PARTICIPACIÓN INTERMITENTE","COMUNICACIÓN PRACTICAMENTE INEXISTENTE",null,null,null,{"$f":"'APROV 1'!Z19","v":9.3000000000000007},{"$f":"'APROV 1'!AC19","v":9}]
[null,null,null,{"$f":"'PARTICIPACIÓN 2'!H18/100","v":0.72273057371096583},{"$f":"'PARTICIPACIÓN 2'!P18/100","v":0.23115468409586057},{"$f":"'PARTICIPACIÓN 2'!X18/100","v":4.6114742193173568E-2}]

{"sheet":"APROV 3","index":9,"n_rows":28,"n_cols":30,"rows_kept":28,"cut":false,"hidden":false,"merged":[[2,1,2,26],[3,1,3,26],[4,1,4,26],[5,1,5,26],[9,3,9,28],[21,16,21,18],[13,0,14,0],[14,13,14,15],[17,13,17,15],[6,1,6,12],[7,1,7,12],[6,13,6,23],[7,13,7,23],[12,0,12,21],[13,16,13,18],[14,16,14,18],[15,16,15,18],[13,1,13,3],[13,4,13,6],[10,3,10,28],[21,0,22,0],[21,1,21,3],[21,4,21,6],[21,7,21,9],[13,10,13,12],[13,7,13,9],[21,22,21,24],[13,22,13,24],[14,22,14,24],[15,22,15,24],[16,22,16,24],[17,22,17,24],[18,22,18,24],[21,19,21,21],[20,0,20,21],[13,19,13,21],[14,19,14,21],[15,19,15,21],[16,19,16,21],[17,19,17,21],[18,16,18,18],[13,13,13,15],[15,13,15,15],[16,13,16,15],[13,25,13,27],[14,25,14,27],[15,25,15,27],[16,25,16,27],[13,28,13,29],[12,22,12,27],[14,28,14,29],[15,28,15,29],[16,28,16,29],[12,28,12,29],[21,10,21,12],[21,13,21,15],[18,13,18,15],[18,4,18,6],[18,1,18,3],[18,7,18,9],[18,10,18,12],[18,28,18,29],[18,25,18,27],[14,1,14,3],[14,10,14,12],[15,10,15,12],[16,10,16,12],[17,10,17,12],[17,28,17,29],[16,7,16,9],[17,7,17,9],[17,25,17,27],[14,7,14,9],[15,7,15,9],[18,19,18,21],[27,0,28,29],[9,0,9,2],[10,0,10,2],[15,1,15,3],[16,1,16,3],[17,1,17,3],[14,4,14,6],[15,4,15,6],[16,4,16,6],[17,4,17,6],[16,16,16,18],[17,16,17,18],[20,22,20,27],[20,28,20,29],[21,25,21,27],[21,28,21,29]]}
[]
[]
[null,"Secretaría de Educación Pública del Estado de Baja California Sur"]
[null,"Dirección de Educación Secundaria"]
[null,"APROVECHAMIENTO Y RIESGO DE NO ACREDITAR"]
[null,"TERCER GRADO"]
[null,"PERIODO EVALUACIÓN:",null,null,null,null,null,null,null,null,null,null,null,{"$f":"IF('APROV 1'!N7:Z7<>0,'APROV 1'!N7:Z7, \"\")","v":"PRIMER TRIMESTRE"}]
[null,"CICLO ESCOLAR :",null,null,null,null,null,null,null,null,null,null,null,{"$f":"IF('APROV 1'!N8:Z8<>0,'APROV 1'!N8:Z8, \"\")","v":"2021-2022"}]
[]
["DIRECCIÓN:",null,null,{"$f":"IF('APROV 1'!D10:AF10<>0,'APROV 1'!D10:AF10, \"\")","v":"EDUCACIÓN SECUNDARIA"}]
["DIRECTORA:",null,null,{"$f":"'Gráfica PART 2'!D10:AF10","v":"MTRA. OFELIA ELIZABETH OCHOA ROMERO"}]
[]
["Promedio de Aprovechamiento de los Campos de Formación Académica",null,null,null,null,null,null,null,null,null,null,null,null,null,null,null,null,null,null,null,null,null,"Promedio de Aprovechamiento de las Áreas de Desarrollo Personal y Social"]
["Modalidad","Español III",null,null,"Matemáticas III",null,null,"Segunda Lengua: Inglés III",null,null,"Ciencias III (Énfasis en Química)",null,null,"Historia II",null,null,"Formación Cívica y Ética II",null,null,"Tecnología III",null,null,"Educación Física III",null,null,"Artes III",null,null,"Prom. Final"]
[null,"CALIF",null,null,"CALIF",null,null,"CALIF",null,null,"CALIF",null,null,"CALIF",null,null,"CALIF",null,null,"CALIF",null,null,"CALIF",null,null,"CALIF",null,null,"CALIF"]
[{"$f":"IF(MATRICULA!A16=0,\"\",MATRICULA!A16)","v":"Grales."},8.6,null,null,8.3000000000000007,null,null,8.6,null,null,8.5,null,null,8.6999999999999993,null,null,8.8000000000000007,null,null,8.9,null,null,9.1999999999999993,null,null,9,null,null,{"$f":"IFERROR(ROUND(AVERAGE(B16:AB16),1),\"\")","v":8.6999999999999993}]
[{"$f":"IF(MATRICULA!A17=0,\"\",MATRICULA!A17)","v":"Técs."},8.5,null,null,8.4,null,null,8.8000000000000007,null,null,8.4,null,null,8.6999999999999993,null,null,8.6,null,null,8.6999999999999993,null,null,9.3000000000000007,null,null,8.8000000000000007,null,null,8.6999999999999993]
[{"$f":"IF(MATRICULA!A18=0,\"\",MATRICULA!A18)","v":"Telesec."},8.1999999999999993,null,null,8,null,null,8.1,null,null,8.1999999999999993,null,null,8.1999999999999993,null,null,8.4,null,null,8.8000000000000007,null,null,8.8000000000000007,null,null,8.8000000000000007,null,null,8.4]
["Gral.",{"$f":"IFERROR(ROUND(AVERAGE(B16:D18),1),\"\")","v":8.4},null,null,{"$f":"IFERROR(ROUND(AVERAGE(E16:G18),1),\"\")","v":8.1999999999999993},null,null,{"$f":"IFERROR(ROUND(AVERAGE(H16:J18),1),\"\")","v":8.5},null,null,{"$f":"IFERROR(ROUND(AVERAGE(K16:M18),1),\"\")","v":8.4},null,null,{"$f":"IFERROR(ROUND(AVERAGE(N16:P18),1),\"\")","v":8.5},null,null,{"$f":"IFERROR(ROUND(AVERAGE(Q16:S18),1),\"\")","v":8.6},null,null,{"$f":"IFERROR(ROUND(AVERAGE(T16:V18),1),\"\")","v":8.8000000000000007},null,null,{"$f":"IFERROR(ROUND(AVERAGE(W16:Y18),1),\"\")","v":9.1},null,null,{"$f":"IFERROR(ROUND(AVERAGE(Z16:AB18),1),\"\")","v":8.9},null,null,{"$f":"IFERROR(ROUND(AVERAGE(AC16:AD18),1),\"\")","v":8.6}]
[]
["Campos de Formación Académica en situacion de riesgo de no acreditar",null,null,null,null,null,null,null,null,null,null,null,null,null,null,null,null,null,null,null,null,null,"Áreas de Desarrollo Personal y Social en situacion de riesgo de no acreditar"]
["Modalidad","Español III",null,null,"Matemáticas III",null,null,"Segunda Lengua: Inglés III",null,null,"Ciencias III (Énfasis en Química)",null,null,"Historia II",null,null,"Formación Cívica y Ética II",null,null,"Tecnología III",null,null,"Educación Física III",null,null,"Artes III",null,null,"Total"]
[null,5,6,"T",5,6,"T",5,6,"T",5,6,"T",5,6,"T",5,6,"T",5,6,"T",5,6,"T",5,6,"T",5,6]
[{"$f":"IF(MATRICULA!A16=0,\"\",MATRICULA!A16)","v":"Grales."},null,530,{"$f":"IF(SUM(B24,C24)=0,\"\",SUM(B24,C24))","v":530},null,673,{"$f":"IF(SUM(E24,F24)=0,\"\",SUM(E24,F24))","v":673},null,412,{"$f":"IF(SUM(H24,I24)=0,\"\",SUM(H24,I24))","v":412},null,5547,{"$f":"IF(SUM(K24,L24)=0,\"\",SUM(K24,L24))","v":5547},null,390,{"$f":"IF(SUM(N24,O24)=0,\"\",SUM(N24,O24))","v":390},null,374,{"$f":"IF(SUM(Q24,R24)=0,\"\",SUM(Q24,R24))","v":374},null,276,{"$f":"IF(SUM(T24,U24)=0,\"\",SUM(T24,U24))","v":276},null,371,{"$f":"IF(SUM(W24,X24)=0,\"\",SUM(W24,X24))","v":371},null,284,{"$f":"IF(SUM(Z24,AA24)=0,\"\",SUM(Z24,AA24))","v":284},{"$f":"IF(SUM(B24,E24,H24,K24,N24,Q24,T24,W24,Z24)=0,\"\",SUM(B24,E24,H24,K24,N24,Q24,T24,W24,Z24))","v":""},8857]
[{"$f":"IF(MATRICULA!A17=0,\"\",MATRICULA!A17)","v":"Técs."},null,597,597,null,695,695,null,482,482,null,734,734,null,454,454,null,621,621,null,674,674,null,382,382,null,489,489,"",5128]
[{"$f":"IF(MATRICULA!A18=0,\"\",MATRICULA!A18)","v":"Telesec."},null,265,265,null,279,279,null,247,247,null,251,251,null,250,250,null,217,217,null,180,180,null,231,231,null,199,199,"",2119]
["Total",{"$f":"IF(SUM(B24:B26)=0,\"\",SUM(B24:B26))","v":""},1392,1392,"",1647,1647,"",1141,1141,"",6532,6532,"",1094,1094,"",1212,1212,"",1130,1130,"",984,984,"",972,972,"",16104]
["Nota: Para las columnas \"Campos de Formación Académica y Áreas de Desarrollo Personal y Social en riesgo de no acreditar\" registre la cantidad de cincos o seis que existen en cada campo o área."]

{"sheet":"PARTICIPACIÓN 3","index":10,"n_rows":18,"n_cols":28,"rows_kept":18,"cut":false,"hidden":false,"merged":[[17,21,17,22],[17,23,17,26],[17,27,17,29],[17,0,17,2],[17,5,17,6],[17,7,17,10],[17,13,17,14],[17,15,17,18],[16,23,16,26],[16,27,16,29],[16,0,16,2],[16,5,16,6],[16,7,16,10],[16,13,16,14],[16,15,16,18],[16,21,16,22],[14,21,14,22],[14,23,14,26],[14,27,14,29],[15,0,15,2],[15,5,15,6],[15,7,15,10],[15,13,15,14],[15,15,15,18],[15,21,15,22],[15,23,15,26],[15,27,15,29],[14,0,14,2],[14,5,14,6],[14,7,14,10],[14,13,14,14],[14,15,14,18],[11,0,11,29],[12,0,13,2],[12,3,12,6],[12,7,13,10],[12,11,12,14],[12,15,13,18],[12,19,12,22],[12,23,13,26],[12,27,13,29],[13,5,13,6],[13,13,13,14],[13,21,13,22],[7,1,7,12],[7,13,7,22],[8,0,8,2],[8,3,8,28],[9,0,9,2],[9,3,9,28],[2,1,2,26],[3,1,3,26],[4,1,4,26],[5,1,5,26],[6,1,6,12],[6,13,6,22]]}
[]
[]
[null,"Secretaría de Educación Pública del Estado de Baja California Sur"]
[null,"Dirección de Educación Secundaria"]
[null,"NIVELES DE COMUNICACIÓN Y PARTICIPACIÓN DE ALUMNOS"]
[null,"TERCER GRADO "]
[null,"PERIODO EVALUACIÓN:",null,null,null,null,null,null,null,null,null,null,null,{"$f":"IF('APROV 1'!N7:Z7<>0,'APROV 1'!N7:Z7, \"\")","v":"PRIMER TRIMESTRE"}]
[null,"CICLO ESCOLAR :",null,null,null,null,null,null,null,null,null,null,null,{"$f":"IF('APROV 1'!N8:Z8<>0,'APROV 1'!N8:Z8, \"\")","v":"2021-2022"}]
["DIRECCIÓN:",null,null,{"$f":"IF('APROV 1'!D10:AF10<>0,'APROV 1'!D10:AF10, \"\")","v":"EDUCACIÓN SECUNDARIA"}]
["DIRECTORA:",null,null,{"$f":"'APROV 3'!D11:AC11","v":"MTRA. OFELIA ELIZABETH OCHOA ROMERO"}]
[]
[" COMUNICACIÓN Y PARTICIPACIÓN CON ALUMNOS  (Registrar cantidad de alumnos)"]
["Modalidad",null,null,"COMUNICACIÓN Y PARTICIPACIÓN SOSTENIDA",null,null,null,"%",null,null,null,"COMUNICACIÓN Y PARTICIPACIÓN INTERMITENTE",null,null,null,"%",null,null,null,"COMUNICACIÓN PRACTICAMENTE INEXISTENTE",null,null,null,"%",null,null,null,"MATRÍCULA\nEXISTENCIA"]
[null,null,null,"PRESENCIAL","VIRTUAL","A DISTANCIA",null,null,null,null,null,"PRESENCIAL","VIRTUAL","A DISTANCIA",null,null,null,null,null,"PRESENCIAL","VIRTUAL","A DISTANCIA"]
[{"$f":"IF(MATRICULA!A16=0,\"\",MATRICULA!A16)","v":"Grales."},null,null,3214,1060,530,null,{"$f":"IFERROR((D15+E15+F15)/AB15*100,\"\")","v":72.953682611996967},null,null,null,660,681,127,null,{"$f":"IFERROR((L15+M15+N15)/AB15*100,\"\")","v":22.293090356871677},null,null,null,62,115,136,null,{"$f":"IFERROR((T15+U15+V15)/AB15*100,\"\")","v":4.7532270311313596},null,null,null,{"$f":"IF(MATRICULA!AH32=0,\"\",MATRICULA!AH32)","v":6585}]
[{"$f":"IF(MATRICULA!A17=0,\"\",MATRICULA!A17)","v":"Técs."},null,null,2849,239,306,null,{"$f":"IFERROR((D16+E16+F16)/AB16*100,\"\")","v":67.207920792079207},null,null,null,958,159,277,null,{"$f":"IFERROR((L16+M16+N16)/AB16*100,\"\")","v":27.603960396039607},null,null,null,70,0,192,null,{"$f":"IFERROR((T16+U16+V16)/AB16*100,\"\")","v":5.1881188118811883},null,null,null,{"$f":"IF(MATRICULA!AH33=0,\"\",MATRICULA!AH33)","v":5050}]
[{"$f":"IF(MATRICULA!A18=0,\"\",MATRICULA!A18)","v":"Telesec."},null,null,895,383,163,null,83.827806864456079,null,null,null,69,85,29,null,10.645724258289704,null,null,null,39,39,17,null,5.5264688772542172,null,null,null,{"$f":"IF(MATRICULA!AH34=0,\"\",MATRICULA!AH34)","v":1719}]
["TOTAL",null,null,{"$f":"SUM(D15:D17)","v":6958},{"$f":"SUM(E15:E17)","v":1682},{"$f":"SUM(F15:G17)","v":999},null,72.180620038939651,null,null,null,{"$f":"SUM(L15:L17)","v":1687},{"$f":"SUM(M15:M17)","v":925},{"$f":"SUM(N15:O17)","v":433},null,22.802156657181367,null,null,null,{"$f":"SUM(T15:T17)","v":171},{"$f":"SUM(U15:U17)","v":154},{"$f":"SUM(V15:W17)","v":345},null,5.0172233038789882,null,null,null,{"$f":"SUM(AB15:AD17)","v":13354}]

{"sheet":"Gráfica APROV 3","index":11,"n_rows":13,"n_cols":14,"rows_kept":13,"cut":false,"hidden":false,"merged":[[2,1,2,26],[3,1,3,26],[4,1,4,26],[8,0,8,2],[8,3,8,28],[9,0,9,2],[5,1,5,12],[5,13,5,23],[6,1,6,12],[6,13,6,23],[9,3,9,28]]}
[]
[]
[null,"Secretaría de Educación Pública del Estado de Baja California Sur"]
[null,"Dirección de Educación Secundaria"]
[null,"TERCER GRADO"]
[null,"PERIODO EVALUACIÓN:",null,null,null,null,null,null,null,null,null,null,null,{"$f":"IF('APROV 1'!N7:Z7<>0,'APROV 1'!N7:Z7, \"\")","v":"PRIMER TRIMESTRE"}]
[null,"CICLO ESCOLAR :",null,null,null,null,null,null,null,null,null,null,null,{"$f":"IF('APROV 1'!N8:Z8<>0,'APROV 1'!N8:Z8, \"\")","v":"2021-2022"}]
[]
["DIRECCIÓN:",null,null,{"$f":"IF('APROV 1'!D10:AF10<>0,'APROV 1'!D10:AF10, \"\")","v":"EDUCACIÓN SECUNDARIA"}]
["DIRECTORA:",null,null,{"$f":"'PARTICIPACIÓN 3'!D10:AC10","v":"MTRA. OFELIA ELIZABETH OCHOA ROMERO"}]
[]
[null,"Español III","Matemáticas III","Segunda Lengua: Inglés III","Ciencias III (Énfasis en Química)","Historia II","Formación Cívica y Ética II","Tecnología III","Educación Física III","Artes III"]
[null,{"$f":"'APROV 3'!B19:D19","v":8.4},{"$f":"'APROV 3'!E19","v":8.1999999999999993},{"$f":"'APROV 3'!H19","v":8.5},{"$f":"'APROV 3'!K19","v":8.4},{"$f":"'APROV 3'!N19","v":8.5},{"$f":"'APROV 3'!Q19","v":8.6},{"$f":"'APROV 3'!T19","v":8.8000000000000007},{"$f":"'APROV 3'!W19","v":9.1},{"$f":"'APROV 3'!Z19","v":8.9}]

{"sheet":"Gráfica PART 3","index":12,"n_rows":14,"n_cols":14,"rows_kept":14,"cut":false,"hidden":false,"merged":[[11,0,30,0],[6,1,6,12],[6,13,6,25],[8,0,8,2],[8,3,8,31],[9,0,9,2],[9,3,9,31],[0,0,0,32],[2,1,2,29],[3,1,3,29],[4,1,4,29],[5,1,5,12],[5,13,5,25]]}
[]
[]
[null,"Secretaría de Educación Pública del Estado de Baja California Sur"]
[null,"Dirección de Educación Secundaria"]
[null,"TERCER GRADO "]
[null,"PERIODO EVALUACIÓN:",null,null,null,null,null,null,null,null,null,null,null,{"$f":"IF('APROV 1'!N7:Z7<>0,'APROV 1'!N7:Z7, \"\")","v":"PRIMER TRIMESTRE"}]
[null,"CICLO ESCOLAR :",null,null,null,null,null,null,null,null,null,null,null,{"$f":"IF('APROV 1'!N8:Z8<>0,'APROV 1'!N8:Z8, \"\")","v":"2021-2022"}]
[]
["DIRECCIÓN:",null,null,{"$f":"IF('APROV 1'!D10:AF10<>0,'APROV 1'!D10:AF10, \"\")","v":"EDUCACIÓN SECUNDARIA"}]
["DIRECTORA:",null,null,{"$f":"'Gráfica APROV 3'!D10:AC10","v":"MTRA. OFELIA ELIZABETH OCHOA ROMERO"}]
[]
[]
[null,{"$f":"'APROV 1'!B19:D19","v":8.4},{"$f":"'APROV 1'!E19","v":8.4},"COMUNICACIÓN Y PARTICIPACIÓN SOSTENIDA","COMUNICACIÓN Y PARTICIPACIÓN INTERMITENTE","COMUNICACIÓN PRACTICAMENTE INEXISTENTE",null,null,null,{"$f":"'APROV 1'!Z19","v":9.3000000000000007},{"$f":"'APROV 1'!AC19","v":9}]
[null,null,null,{"$f":"'PARTICIPACIÓN 3'!H18/100","v":0.72180620038939647},{"$f":"'PARTICIPACIÓN 3'!P18/100","v":0.22802156657181366},{"$f":"'PARTICIPACIÓN 3'!X18/100","v":5.0172233038789885E-2}]

{"sheet":"Gráfica Promedios Finales","index":13,"n_rows":19,"n_cols":14,"rows_kept":19,"cut":false,"hidden":false,"merged":[[7,0,7,2],[7,3,7,28],[8,0,8,2],[8,3,8,28],[2,1,2,26],[3,1,3,26],[4,1,4,12],[4,13,4,23],[5,1,5,12],[5,13,5,23]]}
[]
[]
[null,"Secretaría de Educación Pública del Estado de Baja California Sur"]
[null,"Dirección de Educación Secundaria"]
[null,"PERIODO EVALUACIÓN:",null,null,null,null,null,null,null,null,null,null,null,{"$f":"IF('APROV 1'!N7:Z7<>0,'APROV 1'!N7:Z7, \"\")","v":"PRIMER TRIMESTRE"}]
[null,"CICLO ESCOLAR :",null,null,null,null,null,null,null,null,null,null,null,{"$f":"IF('APROV 1'!N8:Z8<>0,'APROV 1'!N8:Z8, \"\")","v":"2021-2022"}]
[]
["DIRECCIÓN:",null,null,{"$f":"IF('APROV 1'!D10:AF10<>0,'APROV 1'!D10:AF10, \"\")","v":"EDUCACIÓN SECUNDARIA"}]
["DIRECTORA:",null,null,{"$f":"'Gráfica PART 3'!D10:AF10","v":"MTRA. OFELIA ELIZABETH OCHOA ROMERO"}]
[]
[]
[]
[]
[]
[]
[]
[]
[null,"PROMEDIO 1RO","PROMEDIO 2DO","PROMEDIO 3ERO"]
[null,{"$f":"+'APROV 1'!AF19","v":8.6999999999999993},{"$f":"+'APROV 2'!AC18","v":8.6999999999999993},{"$f":"'APROV 3'!AC19","v":8.6}]

{"sheet":"NORMALIDAD MÍNIMA","index":14,"n_rows":39,"n_cols":16,"rows_kept":39,"cut":false,"hidden":false,"merged":[[6,1,6,6],[6,8,6,12],[2,1,2,14],[3,1,3,14],[4,1,4,14],[5,1,5,7],[5,8,5,12],[11,11,11,12],[11,13,11,14],[17,0,17,15],[18,0,19,0],[18,1,23,3],[18,4,18,6],[18,7,19,7],[18,8,18,10],[18,11,18,12],[18,13,18,14],[11,0,12,0],[11,1,11,3],[11,4,11,6],[11,7,12,7],[11,8,11,10],[33,0,33,8],[33,9,33,14],[34,0,34,8],[34,9,34,14],[24,0,24,15],[25,0,26,0],[25,1,25,3],[25,4,25,6],[25,7,26,7],[25,8,25,10],[25,11,25,12],[25,13,25,14],[38,0,38,8],[39,0,39,15],[40,0,56,15],[8,0,8,2],[9,0,9,2],[8,3,8,12],[9,3,9,12],[35,0,35,8],[35,9,35,14],[36,0,36,8],[36,9,36,14],[37,0,37,8],[37,9,37,14],[31,0,31,15],[32,0,32,8],[32,9,32,14]]}
[]
[]
[null,"Secretaría de Educación Pública del Estado de Baja California Sur"]
[null,"Dirección de Educación Secundaria"]
[null,"NORMALIDAD MÍNIMA"]
[null,"PERIODO DE EVALUACIÓN:",null,null,null,null,null,null,{"$f":"'Gráfica Promedios Finales'!N5","v":"PRIMER TRIMESTRE"}]
[null,"CICLO ESCOLAR :",null,null,null,null,null,null,{"$f":"'Gráfica Promedios Finales'!N6","v":"2021-2022"}]
[]
["DIRECCIÓN:",null,null,{"$f":"'Gráfica Promedios Finales'!D8","v":"EDUCACIÓN SECUNDARIA"}]
["DIRECTORA:",null,null,{"$f":"'Gráfica Promedios Finales'!D9","v":"MTRA. OFELIA ELIZABETH OCHOA ROMERO"}]
[]
["Modalidad","DIRECTIVOS\n(Directores, subdirectores)",null,null,"COORDINADORES",null,null,"R","INASISTENCIAS",null,null,"LICENCIAS ECONÓMICAS",null,"LICENCIAS MÉDICAS",null,"TOTAL DE DÍAS NO LABORADOS"]
[null,"H","M","T","H","M","T",null,"I ","P.D.","D.N.L.I y P.D.","L.E."," D.N.L.E.","L.M.","D.N.L.M.","DNLI y PD, DNLE, DNLM"]
[{"$f":"'PARTICIPACIÓN 3'!A15:C15","v":"Grales."},50,46,{"$f":"IF(SUM(B14,C14)=0,\"\",SUM(B14,C14))","v":96},23,22,{"$f":"IF(SUM(E14,F14)=0,\"\",SUM(E14,F14))","v":45},2,3,12,{"$f":"IF(SUM(I14,J14)=0,\"\",SUM(I14,J14))","v":15},17,40,6,3,{"$f":"IF(SUM(K14,M14,O14)=0,\"\",SUM(K14,M14,O14))","v":58}]
[{"$f":"'PARTICIPACIÓN 3'!A16:C16","v":"Técs."},37,23,{"$f":"IF(SUM(B15,C15)=0,\"\",SUM(B15,C15))","v":60},28,23,{"$f":"IF(SUM(E15,F15)=0,\"\",SUM(E15,F15))","v":51},1,1,5,{"$f":"IF(SUM(I15,J15)=0,\"\",SUM(I15,J15))","v":6},26,50,4,94,{"$f":"IF(SUM(K15,M15,O15)=0,\"\",SUM(K15,M15,O15))","v":150}]
[{"$f":"'PARTICIPACIÓN 3'!A17:C17","v":"Telesec."},31,10,{"$f":"IF(SUM(B16,C16)=0,\"\",SUM(B16,C16))","v":41},null,null,{"$f":"IF(SUM(E16,F16)=0,\"\",SUM(E16,F16))","v":""},null,null,null,{"$f":"IF(SUM(I16,J16)=0,\"\",SUM(I16,J16))","v":""},8,33,2,3,36]
["Total",{"$f":"IF(SUM(B14:B16)=0,\"\",SUM(B14:B16))","v":118},79,197,51,45,96,3,4,17,21,51,123,12,100,244]
[]
["Modalidad","PERSONAL  POR HORAS ",null,null,"DOCENTES",null,null,"R","INASISTENCIAS (Horas)",null,null,"LICENCIAS ECONÓMICAS",null,"LICENCIAS MÉDICAS",null,"TOTAL DE HORAS NO LABORADOS"]
[null,null,null,null,"H","M","T",null,"I ","P.D.","H.N.L.I y P.D.","L.E."," H.N.L.E.","L.M.","H.N.L.M.","HNLI y PD, HNLE, HNLM"]
[{"$f":"A14","v":"Grales."},null,null,null,507,595,{"$f":"IF(SUM(E21,F21)=0,\"\",SUM(E21,F21))","v":1102},154,542,272,{"$f":"IF(SUM(I21,J21)=0,\"\",SUM(I21,J21))","v":814},171,1395,54,1482,{"$f":"IF(SUM(K21,M21,O21)=0,\"\",SUM(K21,M21,O21))","v":3691}]
[{"$f":"A15","v":"Técs."},null,null,null,391,455,846,148,548,147,{"$f":"IF(SUM(I22,J22)=0,\"\",SUM(I22,J22))","v":695},229,1782,95,1066,3543]
[{"$f":"A16","v":"Telesec."},null,null,null,139,129,268,null,2,1,3,58,287,9,19,309]
["Total",null,null,null,{"$f":"IF(SUM(E21:E23)=0,\"\",SUM(E21:E23))","v":1037},1179,2216,302,1092,420,1512,458,3464,158,2567,7543]
[]
["Modalidad","ASISTENCIA EDUCATIVA\n(Psicólogos, trabajo social, médicos, prefectos)",null,null,"ADMINISTRATIVO Y DE APOYO",null,null,"R","INASISTENCIAS",null,null,"LICENCIAS ECONÓMICAS",null,"LICENCIAS MÉDICAS",null,"TOTAL DE DÍAS NO LABORADOS"]
[null,"H","M","T","H","M","T",null,"I ","P.D.","D.N.L.I y P.D.","L.E."," D.N.L.E.","L.M.","D.N.L.M.","DNLI y PD, DNLE, DNLM"]
[{"$f":"A21","v":"Grales."},64,142,{"$f":"IF(SUM(B28,C28)=0,\"\",SUM(B28,C28))","v":206},222,243,{"$f":"IF(SUM(E28,F28)=0,\"\",SUM(E28,F28))","v":465},41,126,96,{"$f":"IF(SUM(I28,J28)=0,\"\",SUM(I28,J28))","v":222},270,567,55,543,{"$f":"IF(SUM(K28,M28,O28)=0,\"\",SUM(K28,M28,O28))","v":1332}]
[{"$f":"A22","v":"Técs."},83,90,173,142,185,327,40,52,28,80,164,298,97,390,768]
[{"$f":"A23","v":"Telesec."},18,16,34,48,47,95,null,1,67,68,52,245,8,201,514]
["Total",{"$f":"IF(SUM(B28:B30)=0,\"\",SUM(B28:B30))","v":165},248,413,412,475,887,81,179,191,370,486,1110,160,1134,2614]
[]
["NOTA:",null,null,null,null,null,null,null,null,"NOTA:"]
["I.: INASISTENCIAS",null,null,null,null,null,null,null,null,"H.N.L.E.: HORAS NO LABORADOS POR LICENCIAS ECONÓMICAS"]
["H.N.L.I.: HORAS NO LABORADAS POR INASISTENCIAS",null,null,null,null,null,null,null,null,"D.N.L.E.:  DÍAS NO LABORADOS POR LICENCIAS ECONÓMICAS"]
["D.N.L.I.: DÍAS NO LABORADOS POR INASISTENCIAS",null,null,null,null,null,null,null,null,"L.M.: PERSONAS QUE PRESENTARON LICENCIAS MÉDICAS"]
["R. :  CANTIDAD DE RETARDOS",null,null,null,null,null,null,null,null,"H.N.L.M.: HORAS NO LABORADAS POR LICENCIAS MÉDICAS"]
["L.E.:   PERSONAL QUE SOLICITÓ LICENCIAS ECONÓMICAS",null,null,null,null,null,null,null,null,"D.N.L.M.: DÍAS NO LABORADOS POR LICENCIAS MÉDICAS"]
["P.D.: PERMISOS DIRECCIÓN"]